Reaction Details
TargetD(1A)/D(2) dopamine receptor
LigandBDBM50016888
Substrate/Competitorn/a
Meas. Tech.ChEMBL_59580 (CHEMBL672931)
IC50 9±n/a nM
Citation Hutchison, AWilliams, Mde Jesus, RStone, GASylvester, LClarke, FHSills, MA 2H-[1]benzopyrano[3,4-b]pyridines: synthesis and activity at central monoamine receptors. J Med Chem32:720-7 (1989) D(1A)/D(2) dopamine receptor
Name:D(1A)/D(2) dopamine receptor
Synonyms:Dopamine receptor
Type:n/a
Mol. Mass.:n/a
Description:ASSAY_ID of ChEMBL is 59578
Components:This complex has 2 components.
Component 1
Name:D(2) dopamine receptor
Type:Enzyme Catalytic Domain
Mol. Mass.:50698.79
Organism:BOVINE
Description:P20288
Residue:444
Component 2
Name:D(1A) dopamine receptor
Synonyms:D(1A) dopamine receptor DOPAMINE D1 DRD1_BOVIN | Dopamine receptor
Type:Enzyme Catalytic Domain
Mol. Mass.:49330.65
Organism:BOVINE
Description:DOPAMINE D1 DRD1 BOVINE::Q95136
Residue:446
BDBM50016888
NameBDBM50016888
Synonyms:1-Propyl-2,3,4,4a,10,10a-hexahydro-1H-9-oxa-1-aza-phenanthren-6-ol | CHEMBL162955
TypeSmall organic molecule
Emp. Form.C15H21NO2
Mol. Mass.247.3327
SMILESCCCN1CCC[C@H]2[C@H]1COc1ccc(O)cc21