Reaction Details
TargetSerotonin 2 (5-HT2) receptor
LigandBDBM50016892
Substrate/Competitorn/a
Meas. Tech.ChEMBL_1917 (CHEMBL616971)
IC50 42±n/a nM
Citation Hutchison, AWilliams, Mde Jesus, RStone, GASylvester, LClarke, FHSills, MA 2H-[1]benzopyrano[3,4-b]pyridines: synthesis and activity at central monoamine receptors. J Med Chem32:720-7 (1989) Serotonin 2 (5-HT2) receptor
Name:Serotonin 2 (5-HT2) receptor
Synonyms:5-hydroxytryptamine receptor 2A/2B/2C
Type:n/a
Mol. Mass.:n/a
Description:ASSAY_ID of ChEMBL is 2197419
Components:This complex has 3 components.
Component 1
Name:5-hydroxytryptamine receptor 2B
Type:Enzyme Catalytic Domain
Mol. Mass.:53668.47
Organism:RAT
Description:5-HT2B HTR2B RAT::P30994
Residue:479
Component 2
Name:5-hydroxytryptamine receptor 2C
Synonyms:5-HT2C 5-hydroxytryptamine receptor 2C (5HT2c) 5ht1c Htr2c Serotonin receptor 2a and 2c (5HT2A and 5HT2C)
Type:Enzyme
Mol. Mass.:51935.10
Organism:Rattus norvegicus (Rat)
Description:P08909
Residue:460
Component 3
Name:5-hydroxytryptamine receptor 2A
Synonyms:5-HT-2A 5-HT2A 5-hydroxytryptamine receptor 2A (5HT2A) Htr2 Serotonin Receptor 2A
Type:G Protein-Coupled Receptor (GPCR)
Mol. Mass.:52852.05
Organism:Rattus norvegicus (rat)
Description:Rat cortex membranes 5-HT2A receptors.
Residue:471
BDBM50016892
NameBDBM50016892
Synonyms:5-Methoxy-1,7-dimethyl-2,3,4,4a,10,10a-hexahydro-1H-9-oxa-1-aza-phenanthrene | CHEMBL162449
TypeSmall organic molecule
Emp. Form.C15H21NO2
Mol. Mass.247.3327
SMILESCOc1cc(C)cc2OC[C@@H]3[C@H](CCCN3C)c12