Reaction Details
TargetLeukotriene B4 receptor 1
LigandBDBM50001610
Substrate/Competitorn/a
Meas. Tech.ChEBML_99518
IC50 300±n/a nM
Citation Djuric, SWCollins, PWJones, PHShone, RLTsai, BSFretland, DJButchko, GMVillani-Price, DKeith, RHZemaitis, JM 7-[3-(4-acetyl-3-methoxy-2-propylphenoxy)propoxy]-3,4-dihydro-8- propyl-2H-1-benzopyran-2-carboxylic acid: an orally active selective leukotriene B4 receptor antagonist. J Med Chem32:1145-7 (1989) Leukotriene B4 receptor 1
Name:Leukotriene B4 receptor 1
Type:Enzyme Catalytic Domain
Mol. Mass.:37582.68
Organism:Homo sapiens (Human)
Description:Q15722
Residue:352
BDBM50001610
NameBDBM50001610
Synonyms:7-[3-(4-Acetyl-3-methoxy-2-propyl-phenoxy)-propoxy]-8-propyl-chroman-2-carboxylic acid CGS 24115 SC-41930
TypeSmall organic molecule
Emp. Form.C28H36O7
Mol. Mass.484.5812
SMILESCCCc1c(OCCCOc2ccc3CCC(Oc3c2CCC)C(O)=O)ccc(C(C)=O)c1OC