Reaction Details
TargetThymidylate synthase
LigandBDBM50012244
Substrate/Competitorn/a
Meas. Tech.ChEBML_209109
IC50 100±n/a nM
Citation Patil, SDJones, CNair, MGGalivan, JMaley, FKisliuk, RLGaumont, YDuch, DFerone, R Folate analogues. 32. Synthesis and biological evaluation of 2-desamino-2-methyl-N10-propargyl-5,8-dideazafolic acid and related compounds. J Med Chem32:1284-9 (1989) Thymidylate synthase
Name:Thymidylate synthase
Type:Enzyme
Mol. Mass.:36576.54
Organism:Lactobacillus casei
Description:n/a
Residue:316
BDBM50012244
NameBDBM50012244
Synonyms:2-{4-[(2-Methyl-4-oxo-3,4-dihydro-quinazolin-6-ylmethyl)-prop-2-ynyl-amino]-benzoylamino}-pentanedioic acid CHEMBL25889
TypeSmall organic molecule
Emp. Form.C25H24N4O6
Mol. Mass.476.4813
SMILESCc1nc2ccc(CN(CC#C)c3ccc(cc3)C(=O)NC(CCC(O)=O)C(O)=O)cc2c(=O)[nH]1