Reaction Details
TargetDual specificity calcium/calmodulin-dependent 3',5'-cyclic nucleotide phosphodiesterase 1A/1B
LigandBDBM50017102
Substrate/Competitorn/a
Meas. Tech.ChEMBL_43469 (CHEMBL659371)
IC50>1000000±n/a nM
Citation Marivet, MCBourguignon, JJLugnier, CMann, AStoclet, JCWermuth, CG Inhibition of cyclic adenosine-3',5'-monophosphate phosphodiesterase from vascular smooth muscle by rolipram analogues. J Med Chem32:1450-7 (1989) Dual specificity calcium/calmodulin-dependent 3',5'-cyclic nucleotide phosphodiesterase 1A/1B
Name:Dual specificity calcium/calmodulin-dependent 3',5'-cyclic nucleotide phosphodiesterase 1A/1B
Synonyms:Phosphodiesterase 1
Type:n/a
Mol. Mass.:n/a
Description:ASSAY_ID of ChEMBL is 156011
Components:This complex has 2 components.
Component 1
Name:Dual specificity calcium/calmodulin-dependent 3',5'-cyclic nucleotide phosphodiesterase 1B
Type:PROTEIN
Mol. Mass.:60991.90
Organism:Bos taurus
Description:ChEMBL_104913
Residue:534
Component 2
Name:Dual specificity calcium/calmodulin-dependent 3',5'-cyclic nucleotide phosphodiesterase 1A
Synonyms:Calcium/calmodulin-dependent 3',5'-cyclic nucleotide phosphodiesterase 1A PDE1A Phosphodiesterase 1 | Phosphodiesterase 1A
Type:Enzyme Catalytic Domain
Mol. Mass.:60835.05
Organism:BOVINE
Description:Phosphodiesterase 1 0 BOVINE::P14100
Residue:530
BDBM50017102
NameBDBM50017102
Synonyms:4-(3-Butoxy-4-methoxy-phenyl)-pyrrolidin-2-one | CHEMBL35048
TypeSmall organic molecule
Emp. Form.C15H21NO3
Mol. Mass.263.3321
SMILESCCCCOc1cc(ccc1OC)C1CNC(=O)C1