Reaction Details
TargetThromboxane-A synthase
LigandBDBM17638
Substrate/Competitorn/a
Meas. Tech.ChEBML_207812
IC50 100±n/a nM
Citation Cohen, NWeber, GBanner, BLLopresti, RJSchaer, BFocella, AZenchoff, GBChiu, AMTodaro, LO'Donnell, M 3,4-Dihydro-2H-1-benzopyran-2-carboxylic acids and related compounds as leukotriene antagonists. J Med Chem32:1842-60 (1989) Thromboxane-A synthase
Name:Thromboxane-A synthase
Type:Enzyme
Mol. Mass.:60524.67
Organism:Homo sapiens (Human)
Description:P24557
Residue:533
BDBM17638
NameBDBM17638
Synonyms:2-{1-[(4-chlorophenyl)carbonyl]-5-methoxy-2-methyl-1H-indol-3-yl}acetic acid Indocin US11478464, Compound Indomethacin US9271961, Indomethacin | indometacin
TypeSmall organic molecule
Emp. Form.C19H16ClNO4
Mol. Mass.357.788
SMILESCOc1ccc2n(C(=O)c3ccc(Cl)cc3)c(C)c(CC(O)=O)c2c1