Reaction Details
TargetThromboxane-A synthase
LigandBDBM50000838
Substrate/Competitorn/a
Meas. Tech.ChEBML_207812
IC50 2000±n/a nM
Citation Cohen, NWeber, GBanner, BLLopresti, RJSchaer, BFocella, AZenchoff, GBChiu, AMTodaro, LO'Donnell, M 3,4-Dihydro-2H-1-benzopyran-2-carboxylic acids and related compounds as leukotriene antagonists. J Med Chem32:1842-60 (1989) Thromboxane-A synthase
Name:Thromboxane-A synthase
Type:Enzyme
Mol. Mass.:60524.67
Organism:Homo sapiens (Human)
Description:P24557
Residue:533
BDBM50000838
NameBDBM50000838
Synonyms:CHEMBL416657 Sodium; 3-[3-tert-butylsulfanyl-1-(4-chloro-benzyl)-5-isopropyl-1H-indol-2-yl]-2,2-dimethyl-propionate(Takeda AA 861)
TypeSmall organic molecule
Emp. Form.C27H33ClNO2S
Mol. Mass.471.075
SMILESCC(C)c1ccc2n(Cc3ccc(Cl)cc3)c(CC(C)(C)C([O-])=O)c(SC(C)(C)C)c2c1