Reaction Details
TargetD(2) dopamine receptor
LigandBDBM50017456
Substrate/Competitorn/a
Meas. Tech.ChEBML_62229
Ki>1000±n/a nM
Citation Martin, GEElgin, RJMathiasen, JRDavis, CBKesslick, JMBaldy, WJShank, RPDiStefano, DLFedde, CLScott, MK Activity of aromatic substituted phenylpiperazines lacking affinity for dopamine binding sites in a preclinical test of antipsychotic efficacy. J Med Chem32:1052-6 (1989) D(2) dopamine receptor
Name:D(2) dopamine receptor
Type:G Protein-Coupled Receptor (GPCR)
Mol. Mass.:50931.60
Organism:Rattus norvegicus (rat)
Description:P61169
Residue:444
BDBM50017456
NameBDBM50017456
Synonyms:2-Piperazin-1-yl-phenol EN300-109720
TypeSmall organic molecule
Emp. Form.C10H14N2O
Mol. Mass.178.231
SMILESOc1ccccc1N1CCNCC1