Reaction Details
Target5-hydroxytryptamine receptor 1B
LigandBDBM50001915
Substrate/Competitorn/a
Meas. Tech.ChEBML_1795
Ki 4.4±n/a nM
Citation Martin, GEElgin, RJMathiasen, JRDavis, CBKesslick, JMBaldy, WJShank, RPDiStefano, DLFedde, CLScott, MK Activity of aromatic substituted phenylpiperazines lacking affinity for dopamine binding sites in a preclinical test of antipsychotic efficacy. J Med Chem32:1052-6 (1989) 5-hydroxytryptamine receptor 1B
Name:5-hydroxytryptamine receptor 1B
Type:Protein
Mol. Mass.:43173.33
Organism:Rattus norvegicus (Rat)
Description:P28564
Residue:386
BDBM50001915
NameBDBM50001915
Synonyms:1-(3-chlorophenyl)piperazine m-Chlorophenylpiperazine | mCPP
TypeSmall organic molecule
Emp. Form.C10H13ClN2
Mol. Mass.196.677
SMILESClc1cccc(c1)N1CCNCC1