Reaction Details
TargetThymidylate synthase
LigandBDBM50017873
Substrate/Competitorn/a
Meas. Tech.ChEBML_209958
IC50 280±n/a nM
Citation Jones, TRThornton, TJFlinn, AJackman, ALNewell, DRCalvert, AH Quinazoline antifolates inhibiting thymidylate synthase: 2-desamino derivatives with enhanced solubility and potency. J Med Chem32:847-52 (1989) Thymidylate synthase
Name:Thymidylate synthase
Type:PROTEIN
Mol. Mass.:34957.15
Organism:Mus musculus
Description:ChEMBL_1340097
Residue:307
BDBM50017873
NameBDBM50017873
Synonyms:2-{4-[Allyl-(2-amino-4-oxo-3,4-dihydro-quinazolin-6-ylmethyl)-amino]-benzoylamino}-pentanedioic acid | CHEMBL169071
TypeSmall organic molecule
Emp. Form.C24H25N5O6
Mol. Mass.479.4852
SMILESNc1nc2ccc(CN(CC=C)c3ccc(cc3)C(=O)NC(CCC(O)=O)C(O)=O)cc2c(=O)[nH]1