Reaction Details
TargetPeroxisomal N(1)-acetyl-spermine/spermidine oxidase
LigandBDBM50405939
Substrate/Competitorn/a
Meas. Tech.ChEBML_141590
Ki 1000±n/a nM
Citation Dredar, SABlankenship, JWMarchant, PEManneh, VFries, DS Design and synthesis of inhibitors of N8-acetylspermidine deacetylase. J Med Chem32:984-9 (1989) Peroxisomal N(1)-acetyl-spermine/spermidine oxidase
Name:Peroxisomal N(1)-acetyl-spermine/spermidine oxidase
Type:Enzyme
Mol. Mass.:70274.33
Organism:Homo sapiens (Human)
Description:Q6QHF9
Residue:649
BDBM50405939
NameBDBM50405939
Synonyms:CHEMBL175307
TypeSmall organic molecule
Emp. Form.C14H28N2O2
Mol. Mass.256.3843
SMILESCC(=O)CCCCCNCCCN1CCOCC1