Reaction Details
TargetGastrin/cholecystokinin type B receptor
LigandBDBM21147
Substrate/Competitorn/a
Meas. Tech.ChEBML_75663
Ki 0.280000±n/a nM
Citation Charpentier, BDor, ARoy, PEngland, PPham, HDurieux, CRoques, BP Synthesis and binding affinities of cyclic and related linear analogues of CCK8 selective for central receptors. J Med Chem32:1184-90 (1989) Gastrin/cholecystokinin type B receptor
Name:Gastrin/cholecystokinin type B receptor
Type:G Protein-Coupled Receptor (GPCR)
Mol. Mass.:48445.79
Organism:Homo sapiens (Human)
Description:Stable expression of human CCK-2 receptors in HEK 293 cells.
Residue:447
BDBM21147
NameBDBM21147
Synonyms:(3S)-3-[(2S)-2-[(2S)-2-{2-[(2S)-2-[(2S)-2-[(3S)-3-amino-3-formamidopropanoic acid]-3-[4-(sulfooxy)phenyl]propanamido]-4-(methylsulfanyl)butanamido]acetamido}-3-(1H-indol-3-yl)propanamido]-4-(methylsulfanyl)butanamido]-3-{[(1S)-1-carbamoyl-2-phenylethyl]carbamoyl}propanoic acid CCK-8(SO3) H-Asp-Tyr(SO3H)-Met-Gly-Trp-Met-Asp-Phe-NH2 Syncalide | [125I]CCK-8
Typeradiolabeled ligand
Emp. Form.C49H62N10O16S3
Mol. Mass.1143.269
SMILESCSCC[C@H](NC(=O)[C@H](Cc1ccc(OS(O)(=O)=O)cc1)NC(=O)[C@@H](N)CC(O)=O)C(=O)NCC(=O)N[C@@H](Cc1c[nH]c2ccccc12)C(=O)N[C@@H](CCSC)C(=O)N[C@@H](CC(O)=O)C(=O)N[C@@H](Cc1ccccc1)C(N)=O