Reaction Details
TargetGastrin/cholecystokinin type B receptor
LigandBDBM50018064
Substrate/Competitorn/a
Meas. Tech.ChEBML_75663
Ki 6.4±n/a nM
Citation Charpentier, BDor, ARoy, PEngland, PPham, HDurieux, CRoques, BP Synthesis and binding affinities of cyclic and related linear analogues of CCK8 selective for central receptors. J Med Chem32:1184-90 (1989) Gastrin/cholecystokinin type B receptor
Name:Gastrin/cholecystokinin type B receptor
Type:G Protein-Coupled Receptor (GPCR)
Mol. Mass.:48445.79
Organism:Homo sapiens (Human)
Description:Stable expression of human CCK-2 receptors in HEK 293 cells.
Residue:447
BDBM50018064
NameBDBM50018064
Synonyms:Boc-cyclo-(Asp-Tyr(SO3H)-Nle-D-Lys)-Trp-Nle-Asp-Phe-NH2 | CHEMBL2370588
TypeSmall organic molecule
Emp. Form.C60H81N11O17S
Mol. Mass.1260.414
SMILESCCCC[C@H](NC(=O)[C@H](Cc1c[nH]c2ccccc12)NC(=O)[C@@H]1CCCCNC(=O)C[C@H](NC(=O)OC(C)(C)C)C(=O)N[C@H](Cc2ccc(OS(O)(=O)=O)cc2)C(=O)N[C@@H](CCCC)C(=O)N1)C(=O)N[C@@H](CC(O)=O)C(=O)N[C@H](Cc1ccccc1)C(N)=O