Reaction Details
TargetPapain
LigandBDBM50018174
Substrate/Competitorn/a
Meas. Tech.ChEMBL_152650 (CHEMBL763839)
pH5±n/a
Ki 500±n/a nM
Commentsextracted
Citation Silver, MSHaskell, JH Acid-sensitive latent inhibitors for proteolytic enzymes: synthesis and characterization. J Med Chem32:1253-9 (1989) Papain
Name:Papain
Type:Enzyme
Mol. Mass.:38923.01
Organism:Carica papaya
Description:Papain was purchased from Sigma, Germany.
Residue:345
BDBM50018174
NameBDBM50018174
Synonyms:CHEMBL283109 | N-{2-[(2-Acetylamino-propionyl)-hydrazono]-1-benzyl-ethyl}-benzamide
TypeSmall organic molecule
Emp. Form.C21H24N4O3
Mol. Mass.380.4403
SMILESC[C@H](NC(C)=O)C(=O)NN=CC(Cc1ccccc1)NC(=O)c1ccccc1