Reaction Details
TargetAdenosylhomocysteinase
LigandBDBM50018205
Substrate/Competitorn/a
Meas. Tech.ChEBML_197338
Ki 800±n/a nM
Citation Paisley, SDWolfe, MSBorchardt, RT Oxidation of neplanocin A to the corresponding 3'-keto derivative by S-adenosylhomocysteine hydrolase. J Med Chem32:1415-8 (1989) Adenosylhomocysteinase
Name:Adenosylhomocysteinase
Type:PROTEIN
Mol. Mass.:47714.06
Organism:Homo sapiens (Human)
Description:ChEMBL_1507791
Residue:432
BDBM50018205
NameBDBM50018205
Synonyms:4-(6-Amino-purin-9-yl)-5-hydroxy-2-hydroxymethyl-cyclopent-2-enone | CHEMBL2368540
TypeSmall organic molecule
Emp. Form.C11H11N5O3
Mol. Mass.261.2367
SMILESNc1ncnc2n(cnc12)[C@@H]1C=C(CO)C(=O)[C@H]1O