Reaction Details
TargetNeprilysin
LigandBDBM50002022
Substrate/Competitorn/a
Meas. Tech.ChEBML_144458
IC50 1.4±n/a nM
Citation Xie, JSoleilhac, JMSchmidt, CPeyroux, JRoques, BPFournié-Zaluski, MC New kelatorphan-related inhibitors of enkephalin metabolism: improved antinociceptive properties. J Med Chem32:1497-503 (1989) Neprilysin
Name:Neprilysin
Type:Enzyme
Mol. Mass.:85570.75
Organism:Oryctolagus cuniculus (rabbit)
Description:NEP was purified to homogeneity from rabbit kidney.
Residue:750
BDBM50002022
NameBDBM50002022
Synonyms:(2-Benzyl-3-hydroxycarbamoyl-propionylamino)-acetic acid CHEMBL16779
TypeSmall organic molecule
Emp. Form.C13H16N2O5
Mol. Mass.280.2765
SMILESONC(=O)CC(Cc1ccccc1)C(=O)NCC(O)=O