Reaction Details
TargetFolylpolyglutamate synthase, mitochondrial
LigandBDBM50002473
Substrate/Competitorn/a
Meas. Tech.ChEMBL_68380 (CHEMBL678789)
Ki 5900±n/a nM
Citation Patil, SAShane, BFreisheim, JHSingh, SKHynes, JB Inhibition of mammalian folylpolyglutamate synthetase and human dihydrofolate reductase by 5,8-dideaza analogues of folic acid and aminopterin bearing a terminal L-ornithine. J Med Chem32:1559-65 (1989) Folylpolyglutamate synthase, mitochondrial
Name:Folylpolyglutamate synthase, mitochondrial
Type:PROTEIN
Mol. Mass.:64621.95
Organism:Homo sapiens (Human)
Description:ChEMBL_68676
Residue:587
BDBM50002473
NameBDBM50002473
Synonyms:5-Amino-2-{4-[(2-amino-4-oxo-3,4-dihydro-pteridin-6-ylmethyl)-amino]-benzoylamino}-pentanoic acid | CHEMBL41743
TypeSmall organic molecule
Emp. Form.C19H22N8O4
Mol. Mass.426.4292
SMILESNCCCC(NC(=O)c1ccc(NCc2cnc3nc(N)[nH]c(=O)c3n2)cc1)C(O)=O