Reaction Details
TargetMuscarinic acetylcholine receptor M3
LigandBDBM39341
Substrate/Competitorn/a
Meas. Tech.ChEBML_138843
IC50 600±n/a nM
Citation Engel, WWEberlein, WGMihm, GHammer, RTrummlitz, G Tricyclic compounds as selective muscarinic receptor antagonists. 3. Structure-selectivity relationships in a series of cardioselective (M2) antimuscarinics. J Med Chem32:1718-24 (1989) Muscarinic acetylcholine receptor M3
Name:Muscarinic acetylcholine receptor M3
Type:Enzyme Catalytic Domain
Mol. Mass.:66086.66
Organism:RAT
Description:Cholinergic, muscarinic M3 CHRM3 RAT::P08483
Residue:589
BDBM39341
NameBDBM39341
Synonyms:11-[(4-methylpiperazin-1-yl)acetyl]-5,11-dihydro-6H-pyrido[2,3-b][1,4]benzodiazepin-6-one 11-[2-(4-methylpiperazin-1-yl)acetyl]-5H-pyrido[2,3-b][1,4]benzodiazepin-6-one;hydrochloride 11-[2-(4-methylpiperazino)acetyl]-5H-pyrido[2,3-b][1,4]benzodiazepin-6-one;hydrochloride MLS000069702 PIRENZEPINE DIHYDROCHLORIDE cid_185248
TypeSmall organic molecule
Emp. Form.C19H21N5O2
Mol. Mass.351.4023
SMILESCN1CCN(CC(=O)N2c3ccccc3C(=O)Nc3cccnc23)CC1