Reaction Details
TargetPlatelet-activating factor receptor
LigandBDBM50018341
Substrate/Competitorn/a
Meas. Tech.ChEBML_154997
IC50 4±n/a nM
Citation Tilley, JWClader, JWZawoiski, SWirkus, MLeMahieu, RAO'Donnell, MCrowley, HWelton, AF Biphenylcarboxamide derivatives as antagonists of platelet-activating factor. J Med Chem32:1814-20 (1989) Platelet-activating factor receptor
Name:Platelet-activating factor receptor
Type:Enzyme Catalytic Domain
Mol. Mass.:39219.60
Organism:Homo sapiens (Human)
Description:PAF Platelet activating factor PTAFR HUMAN::P25105
Residue:342
BDBM50018341
NameBDBM50018341
Synonyms:2-Ethyl-3',4'-dimethoxy-biphenyl-4-carboxylic acid (1-methyl-4-pyridin-3-yl-butyl)-amide | CHEMBL53001
TypeSmall organic molecule
Emp. Form.C27H32N2O3
Mol. Mass.432.5546
SMILESCCc1cc(ccc1-c1ccc(OC)c(OC)c1)C(=O)N[C@H](C)CCCc1cccnc1