Reaction Details
TargetPlatelet-activating factor receptor
LigandBDBM50018353
Substrate/Competitorn/a
Meas. Tech.ChEBML_154996
IC50 250±n/a nM
Citation Guthrie, RWKaplan, GLMennona, FATilley, JWKierstead, RWMullin, JGLeMahieu, RAZawoiski, SO'Donnell, MCrowley, H Pentadienyl carboxamide derivatives as antagonists of platelet-activating factor. J Med Chem32:1820-35 (1989) Platelet-activating factor receptor
Name:Platelet-activating factor receptor
Type:Enzyme Catalytic Domain
Mol. Mass.:39219.60
Organism:Homo sapiens (Human)
Description:PAF Platelet activating factor PTAFR HUMAN::P25105
Residue:342
BDBM50018353
NameBDBM50018353
Synonyms:5,5-Bis-(4-fluoro-phenyl)-penta-2,4-dienoic acid (1-methyl-4-pyridin-3-yl-butyl)-amide | CHEMBL300742
TypeSmall organic molecule
Emp. Form.C27H26F2N2O
Mol. Mass.432.5049
SMILES[#6]-[#6@H](-[#6]-[#6]-[#6]-c1cccnc1)-[#7]-[#6](=O)\[#6]=[#6]\[#6]=[#6](\c1ccc(F)cc1)-c1ccc(F)cc1