Reaction Details
TargetPlatelet-activating factor receptor
LigandBDBM50018375
Substrate/Competitorn/a
Meas. Tech.ChEMBL_154996 (CHEMBL767100)
IC50 40±n/a nM
Citation Guthrie, RWKaplan, GLMennona, FATilley, JWKierstead, RWMullin, JGLeMahieu, RAZawoiski, SO'Donnell, MCrowley, H Pentadienyl carboxamide derivatives as antagonists of platelet-activating factor. J Med Chem32:1820-35 (1989) Platelet-activating factor receptor
Name:Platelet-activating factor receptor
Type:Enzyme Catalytic Domain
Mol. Mass.:39219.60
Organism:Homo sapiens (Human)
Description:PAF Platelet activating factor PTAFR HUMAN::P25105
Residue:342
BDBM50018375
NameBDBM50018375
Synonyms:5-(3-Fluoro-phenyl)-5-(3-methoxy-phenyl)-penta-2,4-dienoic acid (4-pyridin-3-yl-butyl)-amide | CHEMBL52971
TypeSmall organic molecule
Emp. Form.C27H27FN2O2
Mol. Mass.430.5139
SMILESCOc1cccc(c1)C(=C\C=C\C(=O)NCCCCc1cccnc1)\c1cccc(F)c1