Reaction Details
TargetPlatelet-activating factor receptor
LigandBDBM50018379
Substrate/Competitorn/a
Meas. Tech.ChEMBL_154996 (CHEMBL767100)
IC50 25±n/a nM
Citation Guthrie, RWKaplan, GLMennona, FATilley, JWKierstead, RWMullin, JGLeMahieu, RAZawoiski, SO'Donnell, MCrowley, H Pentadienyl carboxamide derivatives as antagonists of platelet-activating factor. J Med Chem32:1820-35 (1989) Platelet-activating factor receptor
Name:Platelet-activating factor receptor
Type:Enzyme Catalytic Domain
Mol. Mass.:39219.60
Organism:Homo sapiens (Human)
Description:PAF Platelet activating factor PTAFR HUMAN::P25105
Residue:342
BDBM50018379
NameBDBM50018379
Synonyms:5-(4-Methoxy-phenyl)-hexa-2,4-dienoic acid (1-methyl-4-pyridin-3-yl-butyl)-amide | CHEMBL52966
TypeSmall organic molecule
Emp. Form.C23H28N2O2
Mol. Mass.364.4806
SMILESCOc1ccc(cc1)C(\C)=C\C=C\C(=O)N[C@H](C)CCCc1cccnc1