Reaction Details
TargetPlatelet-activating factor receptor
LigandBDBM50018383
Substrate/Competitorn/a
Meas. Tech.ChEMBL_154996 (CHEMBL767100)
IC50 250±n/a nM
Citation Guthrie, RWKaplan, GLMennona, FATilley, JWKierstead, RWMullin, JGLeMahieu, RAZawoiski, SO'Donnell, MCrowley, H Pentadienyl carboxamide derivatives as antagonists of platelet-activating factor. J Med Chem32:1820-35 (1989) Platelet-activating factor receptor
Name:Platelet-activating factor receptor
Type:Enzyme Catalytic Domain
Mol. Mass.:39219.60
Organism:Homo sapiens (Human)
Description:PAF Platelet activating factor PTAFR HUMAN::P25105
Residue:342
BDBM50018383
NameBDBM50018383
Synonyms:5,5-Bis-(4-methoxy-phenyl)-penta-2,4-dienoic acid [2-(pyridin-3-ylmethoxy)-ethyl]-amide | CHEMBL54068
TypeSmall organic molecule
Emp. Form.C27H28N2O4
Mol. Mass.444.5222
SMILES[#6]-[#8]-c1ccc(cc1)-[#6](=[#6]\[#6]=[#6]\[#6](=O)-[#7]-[#6]-[#6]-[#8]-[#6]-c1cccnc1)\c1ccc(-[#8]-[#6])cc1