Reaction Details
TargetPlatelet-activating factor receptor
LigandBDBM50011671
Substrate/Competitorn/a
Meas. Tech.ChEMBL_154996 (CHEMBL767100)
IC50 40±n/a nM
Citation Guthrie, RWKaplan, GLMennona, FATilley, JWKierstead, RWMullin, JGLeMahieu, RAZawoiski, SO'Donnell, MCrowley, H Pentadienyl carboxamide derivatives as antagonists of platelet-activating factor. J Med Chem32:1820-35 (1989) Platelet-activating factor receptor
Name:Platelet-activating factor receptor
Type:Enzyme Catalytic Domain
Mol. Mass.:39219.60
Organism:Homo sapiens (Human)
Description:PAF Platelet activating factor PTAFR HUMAN::P25105
Residue:342
BDBM50011671
NameBDBM50011671
Synonyms:(2E,4E)-5-(4-Methoxy-phenyl)-deca-2,4-dienoic acid ((R)-1-methyl-4-pyridin-3-yl-butyl)-amide CHEMBL277245 | Ro-24-0238
TypeSmall organic molecule
Emp. Form.C27H36N2O2
Mol. Mass.420.5869
SMILESCCCCC\C(=C/C=C/C(=O)N[C@H](C)CCCc1cccnc1)c1ccc(OC)cc1