Reaction Details
TargetPlatelet-activating factor receptor
LigandBDBM50018395
Substrate/Competitorn/a
Meas. Tech.ChEBML_154996
IC50 30±n/a nM
Citation Guthrie, RWKaplan, GLMennona, FATilley, JWKierstead, RWMullin, JGLeMahieu, RAZawoiski, SO'Donnell, MCrowley, H Pentadienyl carboxamide derivatives as antagonists of platelet-activating factor. J Med Chem32:1820-35 (1989) Platelet-activating factor receptor
Name:Platelet-activating factor receptor
Type:Enzyme Catalytic Domain
Mol. Mass.:39219.60
Organism:Homo sapiens (Human)
Description:PAF Platelet activating factor PTAFR HUMAN::P25105
Residue:342
BDBM50018395
NameBDBM50018395
Synonyms:5-(4-Methoxy-phenyl)-penta-2,4-dienoic acid (1-methyl-4-pyridin-3-yl-butyl)-amide | CHEMBL51760
TypeSmall organic molecule
Emp. Form.C22H26N2O2
Mol. Mass.350.454
SMILESCOc1ccc(\C=C\C=C\C(=O)N[C@H](C)CCCc2cccnc2)cc1