Reaction Details
TargetDihydrofolate reductase
LigandBDBM50018469
Substrate/Competitorn/a
Meas. Tech.ChEMBL_53148 (CHEMBL665868)
Ki 0.800000±n/a nM
Citation Roth, BTidwell, MYFerone, RBaccanari, DPSigel, CWDeAngelis, DElwell, LP 2,4-Diamino-5-benzylpyrimidines as antibacterial agents. 13. Some alkenyl derivatives with high in vitro activity against anaerobic organisms. J Med Chem32:1949-58 (1989) Dihydrofolate reductase
Name:Dihydrofolate reductase
Type:Enzyme
Mol. Mass.:21453.99
Organism:Homo sapiens (Human)
Description:Recombinant human DHFR.
Residue:187
BDBM50018469
NameBDBM50018469
Synonyms:5-(4-Methoxy-3,5-dipropenyl-benzyl)-pyrimidine-2,4-diamine | CHEMBL301030
TypeSmall organic molecule
Emp. Form.C18H22N4O
Mol. Mass.310.3935
SMILESCOc1c(\C=C\C)cc(Cc2cnc(N)nc2N)cc1\C=C\C