Reaction Details
TargetDihydrofolate reductase
LigandBDBM18069
Substrate/Competitorn/a
Meas. Tech.ChEMBL_54421 (CHEMBL667179)
Ki 1.3±n/a nM
Citation Roth, BTidwell, MYFerone, RBaccanari, DPSigel, CWDeAngelis, DElwell, LP 2,4-Diamino-5-benzylpyrimidines as antibacterial agents. 13. Some alkenyl derivatives with high in vitro activity against anaerobic organisms. J Med Chem32:1949-58 (1989) Dihydrofolate reductase
Name:Dihydrofolate reductase
Type:n/a
Mol. Mass.:17532.46
Organism:Escherichia coli
Description:n/a
Residue:157
BDBM18069
NameBDBM18069
Synonyms:5-[(3,4,5-trimethoxyphenyl)methyl]pyrimidine-2,4-diamine TMP Trimethoprim (TMP) | US10870625, Compound TMP
TypeSmall organic molecule
Emp. Form.C14H18N4O3
Mol. Mass.290.3177
SMILESCOc1cc(Cc2cnc(N)nc2N)cc(OC)c1OC