Reaction Details
TargetDihydrofolate reductase
LigandBDBM50018479
Substrate/Competitorn/a
Meas. Tech.ChEMBL_54422 (CHEMBL880683)
Ki 1.6±n/a nM
Citation Roth, BTidwell, MYFerone, RBaccanari, DPSigel, CWDeAngelis, DElwell, LP 2,4-Diamino-5-benzylpyrimidines as antibacterial agents. 13. Some alkenyl derivatives with high in vitro activity against anaerobic organisms. J Med Chem32:1949-58 (1989) Dihydrofolate reductase
Name:Dihydrofolate reductase
Type:n/a
Mol. Mass.:17532.46
Organism:Escherichia coli
Description:n/a
Residue:157
BDBM50018479
NameBDBM50018479
Synonyms:5-(3-Allyl-4-methoxy-5-propyl-benzyl)-pyrimidine-2,4-diamine TCMDC-138039
TypeSmall organic molecule
Emp. Form.C18H24N4O
Mol. Mass.312.4094
SMILESCCCc1cc(Cc2cnc(N)nc2N)cc(CC=C)c1OC