Reaction Details
TargetThromboxane A2 receptor
LigandBDBM50279755
Substrate/Competitorn/a
Meas. Tech.ChEMBL_209431 (CHEMBL814288)
IC50 7.4±n/a nM
Citation Shiraishi, MKato, KTerao, SAshida, YTerashita, ZKito, G Quinones. 4. Novel eicosanoid antagonists: synthesis and pharmacological evaluation. J Med Chem32:2214-21 (1989) Thromboxane A2 receptor
Name:Thromboxane A2 receptor
Type:Enyzme
Mol. Mass.:37445.28
Organism:Homo sapiens (Human)
Description:P21731
Residue:343
BDBM50279755
NameBDBM50279755
Synonyms:7-Phenyl-7-(2,4,5-trimethyl-3,6-dioxo-cyclohexa-1,4-dienyl)-heptanoic acid Seratrodast
TypeSmall organic molecule
Emp. Form.C22H26O4
Mol. Mass.354.4394
SMILESCc1c(C)c(O)c(C(=CCCCCC(O)=O)c2ccccc2)c(C)c1O