Reaction Details
TargetAlpha-1A adrenergic receptor
LigandBDBM50018739
Substrate/Competitorn/a
Meas. Tech.ChEBML_33091
Ki 16±n/a nM
Citation Huff, JRBaldwin, JJdeSolms, SJGuare, JPHunt, CARandall, WCSanders, WSSmith, SJVacca, JPZrada, MM Structure-affinity relationships of arylquinolizines at alpha-adrenoceptors. J Med Chem31:641-5 (1988) Alpha-1A adrenergic receptor
Name:Alpha-1A adrenergic receptor
Type:Enzyme Catalytic Domain
Mol. Mass.:51492.08
Organism:CALF
Description:adrenergic Alpha1 0 CALF
Residue:466
BDBM50018739
NameBDBM50018739
Synonyms:1,3,4,5,6,11b-Hexahydro-2H-11-thia-4a-aza-benzo[a]fluorene | CHEMBL346492
TypeSmall organic molecule
Emp. Form.C15H17NS
Mol. Mass.243.367
SMILESC1CCN2CCc3c(sc4ccccc34)C2C1