Reaction Details
TargetDelta-type opioid receptor
LigandBDBM50019055
Substrate/Competitorn/a
Meas. Tech.ChEBML_147185
Ki 1.4±n/a nM
Citation Gacel, GDaugé, VBreuzé, PDelay-Goyet, PRoques, BP Development of conformationally constrained linear peptides exhibiting a high affinity and pronounced selectivity for delta opioid receptors. J Med Chem31:1891-7 (1988) Delta-type opioid receptor
Name:Delta-type opioid receptor
Type:G Protein-Coupled Receptor (GPCR)
Mol. Mass.:40465.04
Organism:Rattus norvegicus (rat)
Description:Competition binding assays were using CHO-K1 cell membranes expressing the opioid receptor.
Residue:372
BDBM50019055
NameBDBM50019055
Synonyms:2-{2-[2-(2-{2-[2-Amino-3-(4-hydroxy-phenyl)-propionylamino]-3-hydroxy-butyrylamino}-acetylamino)-3-phenyl-propionylamino]-4-methyl-pentanoylamino}-3-hydroxy-butyric acid | CHEMBL55734
TypeSmall organic molecule
Emp. Form.C34H48N6O10
Mol. Mass.700.7791
SMILESCC(C)C[C@H](NC(=O)[C@H](Cc1ccccc1)NC(=O)CNC(=O)[C@@H](NC(=O)[C@@H](N)Cc1ccc(O)cc1)[C@@H](C)O)C(=O)N[C@@H]([C@@H](C)O)C(O)=O