Reaction Details
TargetTranslocator protein
LigandBDBM50019100
Substrate/Competitorn/a
Meas. Tech.ChEBML_153214
Ki 13±n/a nM
Citation Van Dort, MECiliax, BJGildersleeve, DLSherman, PSRosenspire, KCYoung, ABJunck, LWieland, DM Radioiodinated benzodiazepines: agents for mapping glial tumors. J Med Chem31:2081-6 (1988) Translocator protein
Name:Translocator protein
Type:Mitochondrion membrane protein
Mol. Mass.:18945.84
Organism:Rattus norvegicus (rat)
Description:Competitive binding experiments were performed on rat kidney mitochondrial membranes.
Residue:169
BDBM50019100
NameBDBM50019100
Synonyms:5-(4-Chloro-phenyl)-7-iodo-1-methyl-1,3-dihydro-benzo[e][1,4]diazepin-2-one | CHEMBL293009
TypeSmall organic molecule
Emp. Form.C16H12ClIN2O
Mol. Mass.410.637
SMILESCN1c2ccc(I)cc2C(=NCC1=O)c1ccc(Cl)cc1