Reaction Details
TargetMu-type opioid receptor
LigandBDBM50019482
Substrate/Competitorn/a
Meas. Tech.ChEBML_146984
IC50 2.9±n/a nM
Citation Gairin, JEMazarguil, HAlvinerie, PSaint-Pierre, SMeunier, JCCros, J Synthesis and biological activities of dynorphin A analogues with opioid antagonist properties. J Med Chem29:1913-7 (1986) Mu-type opioid receptor
Name:Mu-type opioid receptor
Type:Enzyme Catalytic Domain
Mol. Mass.:11165.58
Organism:GUINEA PIG
Description:P97266
Residue:98
BDBM50019482
NameBDBM50019482
Synonyms:DYNORPHIN A (1-11) dynorphin A
TypeSmall organic molecule
Emp. Form.C63H103N21O13
Mol. Mass.1362.6248
SMILESCC[C@H](C)[C@H](NC(=O)[C@H](CCCNC(N)=N)NC(=O)[C@H](CCCNC(N)=N)NC(=O)[C@H](CC(C)C)NC(=O)[C@H](Cc1ccccc1)NC(=O)CNC(=O)CNC(=O)[C@@H](N)Cc1ccc(O)cc1)C(=O)N[C@@H](CCCNC(N)=N)C(=O)N1CCC[C@H]1C(=O)N[C@@H](CCCCN)C(O)=O