Reaction Details
TargetKappa-type opioid receptor
LigandBDBM50019484
Substrate/Competitorn/a
Meas. Tech.ChEBML_146074
Ki 0.032000±n/a nM
Citation Gairin, JEMazarguil, HAlvinerie, PSaint-Pierre, SMeunier, JCCros, J Synthesis and biological activities of dynorphin A analogues with opioid antagonist properties. J Med Chem29:1913-7 (1986) Kappa-type opioid receptor
Name:Kappa-type opioid receptor
Type:G Protein-Coupled Receptor (GPCR)
Mol. Mass.:42744.99
Organism:Cavia porcellus (domestic guinea pig)
Description:P41144
Residue:380
BDBM50019484
NameBDBM50019484
Synonyms:CHEMBL384584 | NH2-Tyr-D-Trp-Gly-Phe-Leu-Arg-Arg-D-Trp-Arg-D-Pro-Lys-OH
TypeSmall organic molecule
Emp. Form.C63H103N21O13
Mol. Mass.1362.6248
SMILES[#6]-[#6]-[#6@H](-[#6])-[#6@H](-[#7]-[#6](=O)-[#6@H](-[#6]-[#6]-[#6]\[#7]=[#6](\[#7])-[#7])-[#7]-[#6](=O)-[#6@H](-[#6]-[#6]-[#6]\[#7]=[#6](\[#7])-[#7])-[#7]-[#6](=O)-[#6@H](-[#6]-[#6](-[#6])-[#6])-[#7]-[#6](=O)-[#6@H](-[#6]-c1ccccc1)-[#7]-[#6](=O)-[#6]-[#7]-[#6](=O)-[#6]-[#7]-[#6](=O)-[#6@@H](-[#7])-[#6]-c1ccc(-[#8])cc1)-[#6](=O)-[#7]-[#6@@H](-[#6]-[#6]-[#6]\[#7]=[#6](\[#7])-[#7])-[#6](=O)-[#7]-1-[#6]-[#6]-[#6]-[#6@@H]-1-[#6](=O)-[#7]-[#6@@H](-[#6]-[#6]-[#6]-[#6]-[#7])-[#6](-[#8])=O