Reaction Details
TargetBeta-2 adrenergic receptor
LigandBDBM50019968
Substrate/Competitorn/a
Meas. Tech.ChEBML_38483
IC50>10000±n/a nM
Citation DeWald, HABeeson, NWHershenson, FMWise, LDDowns, DAHeffner, TGCoughenour, LLPugsley, TA Synthesis and potential antipsychotic activity of 1H-imidazo[1,2-c]pyrazolo[3,4-e]pyrimidines. J Med Chem31:454-61 (1988) Beta-2 adrenergic receptor
Name:Beta-2 adrenergic receptor
Type:PROTEIN
Mol. Mass.:46896.26
Organism:Rattus norvegicus
Description:ChEMBL_38603
Residue:418
BDBM50019968
NameBDBM50019968
Synonyms:7-Ethyl-1,3,5-trimethyl-6,7-dihydro-1H-1,2,4,5a,8-pentaaza-as-indacene | CHEMBL143865
TypeSmall organic molecule
Emp. Form.C12H17N5
Mol. Mass.231.2969
SMILESCCC1CN2C(=N1)c1c(N=C2C)c(C)nn1C