Reaction Details
TargetBeta-2 adrenergic receptor
LigandBDBM50002338
Substrate/Competitorn/a
Meas. Tech.ChEBML_38483
IC50>10000±n/a nM
Citation DeWald, HABeeson, NWHershenson, FMWise, LDDowns, DAHeffner, TGCoughenour, LLPugsley, TA Synthesis and potential antipsychotic activity of 1H-imidazo[1,2-c]pyrazolo[3,4-e]pyrimidines. J Med Chem31:454-61 (1988) Beta-2 adrenergic receptor
Name:Beta-2 adrenergic receptor
Type:PROTEIN
Mol. Mass.:46896.26
Organism:Rattus norvegicus
Description:ChEMBL_38603
Residue:418
BDBM50002338
NameBDBM50002338
Synonyms:(Thioridazine)10-[2-(1-Methyl-piperidin-2-yl)-ethyl]-2-methylsulfanyl-10H-phenothiazine 10-[2-(1-Methyl-piperidin-2-yl)-ethyl]-2-methylsulfanyl-10H-phenothiazine CHEMBL479 MELLARIL-S TP-21 | US9504692, Thioridazine
TypeSmall organic molecule
Emp. Form.C21H26N2S2
Mol. Mass.370.575
SMILESCSc1ccc2Sc3ccccc3N(CCC3CCCCN3C)c2c1