Reaction Details
TargetD(2) dopamine receptor
LigandBDBM50020185
Substrate/Competitorn/a
Meas. Tech.ChEBML_63037
Ki 1±n/a nM
Citation van Wijngaarden, IKruse, CGvan der Heyden, JATulp, MT 2-Phenylpyrroles as conformationally restricted benzamide analogues. A new class of potential antipsychotics. 2. J Med Chem31:1934-40 (1988) D(2) dopamine receptor
Name:D(2) dopamine receptor
Type:G Protein-Coupled Receptor (GPCR)
Mol. Mass.:50931.60
Organism:Rattus norvegicus (rat)
Description:P61169
Residue:444
BDBM50020185
NameBDBM50020185
Synonyms:4-(2-Methoxy-phenyl)-1-(5-phenyl-1H-pyrrol-2-ylmethyl)-piperidine | CHEMBL57945
TypeSmall organic molecule
Emp. Form.C23H26N2O
Mol. Mass.346.4653
SMILESCOc1ccccc1C1CCN(Cc2ccc([nH]2)-c2ccccc2)CC1