Reaction Details
TargetD(2) dopamine receptor
LigandBDBM50019959
Substrate/Competitorn/a
Meas. Tech.ChEBML_63037
Ki 2.4±n/a nM
Citation van Wijngaarden, IKruse, CGvan der Heyden, JATulp, MT 2-Phenylpyrroles as conformationally restricted benzamide analogues. A new class of potential antipsychotics. 2. J Med Chem31:1934-40 (1988) D(2) dopamine receptor
Name:D(2) dopamine receptor
Type:G Protein-Coupled Receptor (GPCR)
Mol. Mass.:50931.60
Organism:Rattus norvegicus (rat)
Description:P61169
Residue:444
BDBM50019959
NameBDBM50019959
Synonyms:1-(4-Fluoro-phenyl)-4-[4-(2-methoxy-phenyl)-piperazin-1-yl]-butan-1-one CHEMBL58792 | Fluanisone
TypeSmall organic molecule
Emp. Form.C21H25FN2O2
Mol. Mass.356.4338
SMILESCOc1ccccc1N1CCN(CCCC(=O)c2ccc(F)cc2)CC1