Reaction Details
Target5-hydroxytryptamine receptor 1B
LigandBDBM50020192
Substrate/Competitorn/a
Meas. Tech.ChEBML_1797
Ki>10000±n/a nM
Citation Nikam, SSMartin, ARNelson, DL Serotonergic properties of spiroxatrine enantiomers. J Med Chem31:1965-8 (1988) 5-hydroxytryptamine receptor 1B
Name:5-hydroxytryptamine receptor 1B
Type:Protein
Mol. Mass.:43173.33
Organism:Rattus norvegicus (Rat)
Description:P28564
Residue:386
BDBM50020192
NameBDBM50020192
Synonyms:8-(2,3-Dihydro-benzo[1,4]dioxin-2-ylmethyl)-1-phenyl-1,3,8-triaza-spiro[4.5]decan-4-one Spiroxatrine
TypeSmall organic molecule
Emp. Form.C22H25N3O3
Mol. Mass.379.4522
SMILESO=C1NCN(c2ccccc2)C11CCN(CC2COc3ccccc3O2)CC1