Reaction Details
TargetEstrogen receptor beta
LigandBDBM50020285
Substrate/Competitorn/a
Meas. Tech.ChEMBL_65914 (CHEMBL677160)
IC50 780±n/a nM
Citation Ruenitz, PCArrendale, RFSchmidt, WFThompson, CBNanavati, NT Phenolic metabolites of clomiphene: [(E,Z)-2-[4-(1,2-diphenyl-2-chlorovinyl)phenoxy]ethyl]diethylamine. Preparation, electrophilicity, and effects in MCF 7 breast cancer cells. J Med Chem32:192-7 (1989) Estrogen receptor beta
Name:Estrogen receptor beta
Synonyms:Estrogen receptor
Type:n/a
Mol. Mass.:n/a
Description:ASSAY_ID of ChEMBL is 99778
Components:This complex has 2 components.
Component 1
Name:Estrogen receptor beta
Type:Protein
Mol. Mass.:59238.43
Organism:Homo sapiens (Human)
Description:Q92731
Residue:530
Component 2
Name:Estrogen receptor
Synonyms:ER ESR ESR1_HUMAN Estrogen receptor Estrogen receptor (ER-alpha) Estrogen receptor alpha (ER) Nuclear receptor subfamily 3 group A member 1
Type:Protein
Mol. Mass.:66230.44
Organism:Homo sapiens (Human)
Description:P03372
Residue:595
BDBM50020285
NameBDBM50020285
Synonyms:3'-Methoxy-4'Hydroxyclomiphene CHEMBL955
TypeSmall organic molecule
Emp. Form.C27H30ClNO3
Mol. Mass.451.985
SMILESCCN(CC)CCOc1ccc(cc1)C(=C(\Cl)c1ccccc1)\c1ccc(O)c(OC)c1