Reaction Details
Target3-hydroxy-3-methylglutaryl-coenzyme A reductase
LigandBDBM50020291
Substrate/Competitorn/a
Meas. Tech.ChEBML_365
IC50 1.3±n/a nM
Citation Heathcock, CHDavis, BRHadley, CR Synthesis and biological evaluation of a monocyclic, fully functional analogue of compactin. J Med Chem32:197-202 (1989) 3-hydroxy-3-methylglutaryl-coenzyme A reductase
Name:3-hydroxy-3-methylglutaryl-coenzyme A reductase
Type:Enzyme
Mol. Mass.:96689.85
Organism:Rattus norvegicus (rat)
Description:Isolated rat liver microsomes were used as enzyme source.
Residue:887
BDBM50020291
NameBDBM50020291
Synonyms:3-Hydroxy-5-oxo-7-phenyl-heptanoic acid | CHEMBL60053
TypeSmall organic molecule
Emp. Form.C13H16O4
Mol. Mass.236.2637
SMILESO[C@@H](CC(O)=O)CC(=O)CCc1ccccc1