Reaction Details
Target5-hydroxytryptamine receptor 1A
LigandBDBM10755
Substrate/Competitorn/a
Meas. Tech.ChEMBL_288 (CHEMBL615726)
Ki 2.8±n/a nM
Citation Chumpradit, SKung, HFBillings, JGuo, YZWu, YShih, J Preparation and biodistribution of 1-[2-(3-[125I]iodo-4-aminophenyl)ethyl]-4-[3-(trifluoromethyl) phenyl]piperazine and 1-[2-(3-[125I]iodo-4-azidophenyl)ethyl]-4-[3-(trifluoromethyl)phenyl] piperazine. J Med Chem32:543-7 (1989) 5-hydroxytryptamine receptor 1A
Name:5-hydroxytryptamine receptor 1A
Type:n/a
Mol. Mass.:46122.49
Organism:Homo sapiens (Human)
Description:n/a
Residue:422
BDBM10755
NameBDBM10755
Synonyms:14C-5-hydroxy tryptamine creatinine disulfate 5-HT 5-hydroxy tryptamine creatinine disulfate Serotonin | [3H]-5-HT
TypeSmall organic molecule
Emp. Form.C10H12N2O
Mol. Mass.176.2151
SMILESNCCc1c[nH]c2ccc(O)cc12