Reaction Details
Target5-hydroxytryptamine receptor 1A
LigandBDBM50020578
Substrate/Competitorn/a
Meas. Tech.ChEMBL_587 (CHEMBL615457)
Ki 20±n/a nM
Citation Chumpradit, SKung, HFBillings, JGuo, YZWu, YShih, J Preparation and biodistribution of 1-[2-(3-[125I]iodo-4-aminophenyl)ethyl]-4-[3-(trifluoromethyl) phenyl]piperazine and 1-[2-(3-[125I]iodo-4-azidophenyl)ethyl]-4-[3-(trifluoromethyl)phenyl] piperazine. J Med Chem32:543-7 (1989) 5-hydroxytryptamine receptor 1A
Name:5-hydroxytryptamine receptor 1A
Type:n/a
Mol. Mass.:46122.49
Organism:Homo sapiens (Human)
Description:n/a
Residue:422
BDBM50020578
NameBDBM50020578
Synonyms:1-[2-(4-Azido-3-iodo-phenyl)-ethyl]-4-(3-trifluoromethyl-phenyl)-piperazine | CHEMBL155615
TypeSmall organic molecule
Emp. Form.C19H19F3IN5
Mol. Mass.501.2873
SMILESFC(F)(F)c1cccc(c1)N1CCN(CCc2ccc(N=[N+]=[N-])c(I)c2)CC1