Reaction Details
Target5-hydroxytryptamine receptor 1A
LigandBDBM50020579
Substrate/Competitorn/a
Meas. Tech.ChEMBL_585 (CHEMBL615455)
Ki 5±n/a nM
Citation Chumpradit, SKung, HFBillings, JGuo, YZWu, YShih, J Preparation and biodistribution of 1-[2-(3-[125I]iodo-4-aminophenyl)ethyl]-4-[3-(trifluoromethyl) phenyl]piperazine and 1-[2-(3-[125I]iodo-4-azidophenyl)ethyl]-4-[3-(trifluoromethyl)phenyl] piperazine. J Med Chem32:543-7 (1989) 5-hydroxytryptamine receptor 1A
Name:5-hydroxytryptamine receptor 1A
Type:n/a
Mol. Mass.:46122.49
Organism:Homo sapiens (Human)
Description:n/a
Residue:422
BDBM50020579
NameBDBM50020579
Synonyms:3-{2-[4-(3-Trifluoromethyl-phenyl)-piperazin-1-yl]-ethyl}-phenylamine | CHEMBL423045
TypeSmall organic molecule
Emp. Form.C19H22F3N3
Mol. Mass.349.3933
SMILESNc1cccc(CCN2CCN(CC2)c2cccc(c2)C(F)(F)F)c1