Reaction Details
TargetVasopressin V2 receptor
LigandBDBM50020652
Substrate/Competitorn/a
Meas. Tech.ChEMBL_215034 (CHEMBL820884)
Ki 30±n/a nM
Citation Huffman, WFAli, FEBryan, WMCallahan, JFMoore, MLSilvestri, JSYim, NCKinter, LBMcDonald, JEAshton-Shue, D Novel vasopressin analogues that help define a minimum effective antagonist pharmacophore. J Med Chem28:1759-60 (1986) Vasopressin V2 receptor
Name:Vasopressin V2 receptor
Type:PROTEIN
Mol. Mass.:40556.17
Organism:Sus scrofa
Description:ChEMBL_214870
Residue:370
BDBM50020652
NameBDBM50020652
Synonyms:1-[19-Benzyl-13-carbamoylmethyl-22-(4-ethoxy-benzyl)-16-isopropyl-12,15,18,21,24-pentaoxo-7,8-dithia-11,14,17,20,23-pentaaza-spiro[5.19]pentacosane-10-carbonyl]-pyrrolidine-2-carboxylic acid (5-amino-pentyl)-amide | CHEMBL264540
TypeSmall organic molecule
Emp. Form.C50H73N9O9S2
Mol. Mass.1008.3
SMILESCCOc1ccc(C[C@H]2NC(=O)CC3(CCCCC3)SSC[C@@H](NC(=O)[C@@H](CC(N)=O)NC(=O)[C@@H](NC(=O)[C@@H](Cc3ccccc3)NC2=O)C(C)C)C(=O)N2CCC[C@@H]2C(=O)NCCCCCN)cc1