Reaction Details
TargetVasopressin V2 receptor
LigandBDBM50020653
Substrate/Competitorn/a
Meas. Tech.ChEBML_211260
Ki 6.4±n/a nM
Citation Yim, NCMoore, MLHuffman, WFBryan, HGChang, HLKinter, LBEdwards, RStassen, FLSchmidt, DHeckman, G Potent antagonists of vasopressin antidiuretic activity that lack the beta,beta-cyclopentamethylene-beta-mercaptopropionic acid substitution at position 1. J Med Chem29:2425-6 (1987) Vasopressin V2 receptor
Name:Vasopressin V2 receptor
Type:PROTEIN
Mol. Mass.:40556.17
Organism:Sus scrofa
Description:ChEMBL_214870
Residue:370
BDBM50020653
NameBDBM50020653
Synonyms:1-[19-Benzyl-13-carbamoylmethyl-22-(4-ethoxy-benzyl)-16-isopropyl-12,15,18,21,24-pentaoxo-7,8-dithia-11,14,17,20,23-pentaaza-spiro[5.19]pentacosane-10-carbonyl]-pyrrolidine-2-carboxylic acid [1-(carbamoylmethyl-carbamoyl)-4-guanidino-butyl]-amide | CHEMBL216606
TypeSmall organic molecule
Emp. Form.C53H77N13O11S2
Mol. Mass.1136.389
SMILESCCOc1ccc(C[C@H]2NC(=O)CC3(CCCCC3)SSC[C@@H](NC(=O)[C@@H](CC(N)=O)NC(=O)[C@@H](NC(=O)[C@@H](Cc3ccccc3)NC2=O)C(C)C)C(=O)N2CCC[C@H]2C(=O)N[C@H](CCCNC(N)=N)C(=O)NCC(N)=O)cc1