Reaction Details
TargetD(1A) dopamine receptor
LigandBDBM60917
Substrate/Competitorn/a
Meas. Tech.ChEBML_58154
EC50 57±n/a nM
Citation Weinstock, JGaitanopoulos, DEStringer, ODFranz, RGHieble, JPKinter, LBMann, WAFlaim, KEGessner, G Synthesis and evaluation of non-catechol D-1 and D-2 dopamine receptor agonists: benzimidazol-2-one, benzoxazol-2-one, and the highly potent benzothiazol-2-one 7-ethylamines. J Med Chem30:1166-76 (1987) D(1A) dopamine receptor
Name:D(1A) dopamine receptor
Type:Enzyme Catalytic Domain
Mol. Mass.:49429.75
Organism:RAT
Description:P18901
Residue:446
BDBM60917
NameBDBM60917
Synonyms:9-chloranyl-5-(4-hydroxyphenyl)-2,3,4,5-tetrahydro-1H-3-benzazepine-7,8-diol;methanesulfonic acid 9-chloro-5-(4-hydroxyphenyl)-2,3,4,5-tetrahydro-1H-3-benzazepine-7,8-diol;methanesulfonic acid FENOLDOPAM MESYLATE SMR000469190 | cid_49659
TypeSmall organic molecule
Emp. Form.C16H16ClNO3
Mol. Mass.305.756
SMILESOc1ccc(cc1)C1CNCCc2c(Cl)c(O)c(O)cc12