Reaction Details
Target5-hydroxytryptamine receptor 1A
LigandBDBM50016737
Substrate/Competitorn/a
Meas. Tech.ChEBML_1318
Ki 1.3±n/a nM
Citation Glennon, RATiteler, MLyon, RASlusher, RM N,N-di-n-propylserotonin: binding at serotonin binding sites and a comparison with 8-hydroxy-2-(di-n-propylamino)tetralin. J Med Chem31:867-70 (1988) 5-hydroxytryptamine receptor 1A
Name:5-hydroxytryptamine receptor 1A
Type:G Protein-Coupled Receptor (GPCR)
Mol. Mass.:46445.29
Organism:Rattus norvegicus (rat)
Description:Binding assays were performed using rat hippocampal membranes.
Residue:422
BDBM50016737
NameBDBM50016737
Synonyms:(8-Methoxy-1,2,3,4-tetrahydro-naphthalen-2-yl)-dipropyl-amine | CHEMBL11760
TypeSmall organic molecule
Emp. Form.C17H27NO
Mol. Mass.261.4024
SMILESCCCN(CCC)C1CCc2cccc(OC)c2C1