Reaction Details
TargetAdenosine receptor A1
LigandBDBM82010
Substrate/Competitorn/a
Meas. Tech.ChEBML_29319
Ki 2.9±n/a nM
Citation Jacobson, KAKirk, KLPadgett, WLDaly, JW Functionalized congeners of 1,3-dialkylxanthines: preparation of analogues with high affinity for adenosine receptors. J Med Chem28:1334-40 (1985) Adenosine receptor A1
Name:Adenosine receptor A1
Type:Protein
Mol. Mass.:36704.13
Organism:Rattus norvegicus (rat)
Description:n/a
Residue:326
BDBM82010
NameBDBM82010
Synonyms:1,3-Dipropyl-8-(4-hydroxyphenyl)xanthine CHEMBL27155
Typen/a
Emp. Form.C17H20N4O3
Mol. Mass.328.3657
SMILESCCCn1c2nc([nH]c2c(=O)n(CCC)c1=O)-c1ccc(O)cc1