Reaction Details
TargetAdenosine receptor A1
LigandBDBM50021087
Substrate/Competitorn/a
Meas. Tech.ChEBML_29319
Ki 26±n/a nM
Citation Jacobson, KAKirk, KLPadgett, WLDaly, JW Functionalized congeners of 1,3-dialkylxanthines: preparation of analogues with high affinity for adenosine receptors. J Med Chem28:1334-40 (1985) Adenosine receptor A1
Name:Adenosine receptor A1
Type:Protein
Mol. Mass.:36704.13
Organism:Rattus norvegicus (rat)
Description:n/a
Residue:326
BDBM50021087
NameBDBM50021087
Synonyms:2-[4-(1,3-Dimethyl-2,6-dioxo-2,3,6,7-tetrahydro-1H-purin-8-yl)-phenoxy]-N-p-tolyl-acetamide CHEMBL441598
TypeSmall organic molecule
Emp. Form.C22H21N5O4
Mol. Mass.419.4332
SMILESCc1ccc(NC(=O)COc2ccc(cc2)-c2nc3n(C)c(=O)n(C)c(=O)c3[nH]2)cc1